BDBM50018548 CHEMBL3290679
SMILES COc1cc(ccc1CN1C(C(C(=O)c2ccccc2)=C(N[C@H](C)c2ccccc2)C1=O)c1ccc(Br)cc1)C(F)(F)F
InChI Key InChIKey=GFVBMLCFPUXLPM-UBIBJYAGSA-N
Data  1 KI
  Tab Delimited (TSV)   2D SDfile   Computed 3D by Vconf -m prep SDfile
Find this compound or compounds like it in BindingDB:
Activity Spreadsheet -- Enzyme Inhibition Constant Data from BindingDB
Found 1 hit for monomerid = 50018548
TargetE3 ubiquitin-protein ligase Mdm2(Homo sapiens (Human))
Second Military Medical University
Curated by ChEMBL
LigandPNGBDBM50018548(CHEMBL3290679)
Affinity DataKi: >1.00E+5nM. Assay description: Binding affinity to MDM2 (unknown origin) assessed as inhibition of interaction with p53 after 1 hr by fluorescence polarization binding assay
In DepthDetails ArticlePubMed