BDBM50018715 2-{2-[2-(2-{2-[2-Amino-3-(4-hydroxy-phenyl)-propionylamino]-3-hydroxy-butyrylamino}-acetylamino)-3-phenyl-propionylamino]-4-methyl-pentanoylamino}-3-hydroxy-propionic acid::CHEMBL125564
SMILES CC(C)C[C@H](NC(=O)[C@H](Cc1ccccc1)NC(=O)CNC(=O)[C@H](NC(=O)[C@@H](N)Cc1ccc(O)cc1)[C@@H](C)O)C(=O)N[C@@H](CO)C(O)=O
InChI Key InChIKey=PNBNSLOJUXPNIY-PWRRRBSQSA-N
Data  2 KI  1 IC50
  Tab Delimited (TSV)   2D SDfile   Computed 3D by Vconf -m prep SDfile
Find this compound or compounds like it in BindingDB:
Activity Spreadsheet -- Enzyme Inhibition Constant Data from BindingDB
Found 3 hits for monomerid = 50018715
TargetDelta-type opioid receptor(Rattus norvegicus (rat))
University Of Paris
Curated by ChEMBL
LigandPNGBDBM50018715(2-{2-[2-(2-{2-[2-Amino-3-(4-hydroxy-phenyl)-propio...)
Affinity DataKi:  4.20nM. Assay description: Inhibition of [3H]DSLET binding to delta 1 opioid receptors in rat brain membranes
In DepthDetails ArticlePubMed
TargetMu-type opioid receptor(Rattus norvegicus (rat))
University Of Paris
Curated by ChEMBL
LigandPNGBDBM50018715(2-{2-[2-(2-{2-[2-Amino-3-(4-hydroxy-phenyl)-propio...)
Affinity DataKi:  42nM. Assay description: Inhibition of [3H]DAGO binding to mu 1 opioid receptor in rat brain membranes
In DepthDetails ArticlePubMed
TargetMu-type opioid receptor(GUINEA PIG)
University Of Paris
Curated by ChEMBL
LigandPNGBDBM50018715(2-{2-[2-(2-{2-[2-Amino-3-(4-hydroxy-phenyl)-propio...)
Affinity DataIC50:  99nM. Assay description: Inhibition of electrically evoked contraction of guinea pig ileum (myenteric plexus:longitudinal muscle preparation) by antagonist action at mu 1 opi...
In DepthDetails ArticlePubMed