BDBM50018764 2-(3,4-Dichloro-phenoxy)-N-methyl-N-(2-pyrrolidin-1-yl-cyclohexyl)-acetamide; hydrochloride::CHEMBL541619
SMILES CN([C@@H]1CCCC[C@H]1N1CCCC1)C(=O)COc1ccc(Cl)c(Cl)c1
InChI Key InChIKey=BUFGEOWFEWGNLG-QZTJIDSGSA-N
Data  2 KI
  Tab Delimited (TSV)   2D SDfile   Computed 3D by Vconf -m prep SDfile
Find this compound or compounds like it in BindingDB:
Activity Spreadsheet -- Enzyme Inhibition Constant Data from BindingDB
Found 2 hits for monomerid = 50018764
TargetKappa-type opioid receptor(Cavia porcellus (domestic guinea pig))
Parke-Davis Research Unit
Curated by ChEMBL
LigandPNGBDBM50018764(2-(3,4-Dichloro-phenoxy)-N-methyl-N-(2-pyrrolidin-...)
Affinity DataKi:  35nM. Assay description: Binding affinity for the Opioid receptor kappa 1
In DepthDetails ArticlePubMed
TargetMu-type opioid receptor(GUINEA PIG)
Parke-Davis Research Unit
Curated by ChEMBL
LigandPNGBDBM50018764(2-(3,4-Dichloro-phenoxy)-N-methyl-N-(2-pyrrolidin-...)
Affinity DataKi:  620nM. Assay description: Binding affinity for the Opioid receptor mu 1
In DepthDetails ArticlePubMed