BDBM50018767 CHEMBL535581::N-(2-Azocan-1-yl-cyclohexyl)-N-methyl-2-(2,3,4,5-tetrachloro-phenoxy)-acetamide; hydrochloride, Hydrate
SMILES CN([C@@H]1CCCC[C@H]1N1CCCCCCC1)C(=O)COc1cc(Cl)c(Cl)c(Cl)c1Cl
InChI Key InChIKey=UMIVHOMETMYQEH-IAGOWNOFSA-N
Data  2 KI
  Tab Delimited (TSV)   2D SDfile   Computed 3D by Vconf -m prep SDfile
Find this compound or compounds like it in BindingDB:
Activity Spreadsheet -- Enzyme Inhibition Constant Data from BindingDB
Found 2 hits for monomerid = 50018767
TargetKappa-type opioid receptor(Cavia porcellus (domestic guinea pig))
Parke-Davis Research Unit
Curated by ChEMBL
LigandPNGBDBM50018767(CHEMBL535581 | N-(2-Azocan-1-yl-cyclohexyl)-N-meth...)
Affinity DataKi:  5.60nM. Assay description: Binding affinity for the Opioid receptor kappa 1
In DepthDetails ArticlePubMed
TargetMu-type opioid receptor(GUINEA PIG)
Parke-Davis Research Unit
Curated by ChEMBL
LigandPNGBDBM50018767(CHEMBL535581 | N-(2-Azocan-1-yl-cyclohexyl)-N-meth...)
Affinity DataKi:  3.60E+3nM. Assay description: Binding affinity for the Opioid receptor mu 1
In DepthDetails ArticlePubMed