BDBM50018845 CHEMBL3286869
SMILES NCCCNCCCCNCCCNCCCN(O)CCCNC(=O)Cc1c[nH]c2ccccc12
InChI Key InChIKey=LIURIBSBVUMOJS-UHFFFAOYSA-N
Data  2 IC50
  Tab Delimited (TSV)   2D SDfile   Computed 3D by Vconf -m prep SDfile
Find this compound or compounds like it in BindingDB:
Activity Spreadsheet -- Enzyme Inhibition Constant Data from BindingDB
Found 2 hits for monomerid = 50018845
TargetGlutamate receptor 1(Rattus norvegicus (Rat))
University Of Copenhagen
Curated by ChEMBL
LigandPNGBDBM50018845(CHEMBL3286869)
Affinity DataIC50:  11nM. Assay description: Inhibition of rat recombinant GluA1 expressed in Xenopus oocytes assessed as inhibition of glutamate-induced channel current at holding potential of ...
In DepthDetails ArticlePubMed
TargetGlutamate receptor ionotropic, NMDA 1/2A(Rattus norvegicus (Rat))
University Of Copenhagen
Curated by ChEMBL
LigandPNGBDBM50018845(CHEMBL3286869)
Affinity DataIC50:  12nM. Assay description: Inhibition of rat recombinant GluN1/2A expressed in Xenopus oocytes assessed as inhibition of glutamate/glycine-evoked channel current at holding pot...
In DepthDetails ArticlePubMed