BDBM50018974 CHEMBL3287446
SMILES Cl.COc1ccc(NC(=O)c2cc(on2)-c2ccc(NC(N)=N)cc2)c(OC)c1
InChI Key InChIKey=GEWCIYBFJPBNEZ-UHFFFAOYSA-N
Data  1 IC50
  Tab Delimited (TSV)   2D SDfile   Computed 3D by Vconf -m prep SDfile
Find this compound or compounds like it in BindingDB:
Activity Spreadsheet -- Enzyme Inhibition Constant Data from BindingDB
Found 1 hit for monomerid = 50018974
TargetAcrosin(Homo sapiens (Human))
Second Military Medical University
Curated by ChEMBL
LigandPNGBDBM50018974(CHEMBL3287446)
Affinity DataIC50:  1.40E+3nM. Assay description: Inhibition of human acrosin using N-alpha-benzoyl-L-arginine p-nitroanilide as substrate after 3 hrs by spectrophotometry
In DepthDetails ArticlePubMed