BDBM50018982 CHEMBL3287454
SMILES Cl.Cc1ccccc1NC(=O)c1cc(on1)-c1ccc(NC(N)=N)cc1
InChI Key InChIKey=QZXMXASYUXDWNX-UHFFFAOYSA-N
Data  1 IC50
  Tab Delimited (TSV)   2D SDfile   Computed 3D by Vconf -m prep SDfile
Find this compound or compounds like it in BindingDB:
Activity Spreadsheet -- Enzyme Inhibition Constant Data from BindingDB
Found 1 hit for monomerid = 50018982
TargetAcrosin(Homo sapiens (Human))
Second Military Medical University
Curated by ChEMBL
LigandPNGBDBM50018982(CHEMBL3287454)
Affinity DataIC50:  1.44E+4nM. Assay description: Inhibition of human acrosin using N-alpha-benzoyl-L-arginine p-nitroanilide as substrate after 3 hrs by spectrophotometry
In DepthDetails ArticlePubMed