BDBM50019202 7-Chloro-3-(1H-indol-3-ylmethyl)-5-phenyl-1,3-dihydro-benzo[e][1,4]diazepin-2-one::CCK antagonist synthetic 5::CHEMBL70728
SMILES Clc1ccc2NC(=O)[C@@H](Cc3c[nH]c4ccccc34)N=C(c3ccccc3)c2c1
InChI Key InChIKey=OAAIQFQHSUFGKD-JOCHJYFZSA-N
Data  2 KI  6 IC50
  Tab Delimited (TSV)   2D SDfile   Computed 3D by Vconf -m prep SDfile
Find this compound or compounds like it in BindingDB:
Activity Spreadsheet -- Enzyme Inhibition Constant Data from BindingDB
Found 8 hits for monomerid = 50019202
TargetCholecystokinin(RAT)
Merck Sharp & Dohme Research Laboratories
Curated by PDSP Ki Database
LigandPNGBDBM50019202(7-Chloro-3-(1H-indol-3-ylmethyl)-5-phenyl-1,3-dihy...)
Affinity DataKi:  3.40E+3nM
In DepthDetails ArticlePubMed
TargetGamma-aminobutyric acid receptor subunit alpha-1(Rattus norvegicus (Rat))
Merck Sharp & Dohme Research Laboratories
Curated by PDSP Ki Database
LigandPNGBDBM50019202(7-Chloro-3-(1H-indol-3-ylmethyl)-5-phenyl-1,3-dihy...)
Affinity DataKi: >1.00E+4nM
In DepthDetails ArticlePubMed
TargetCholecystokinin receptor type A(Mus musculus)
Merck Sharp & Dohme Research Laboratories
Curated by ChEMBL
LigandPNGBDBM50019202(7-Chloro-3-(1H-indol-3-ylmethyl)-5-phenyl-1,3-dihy...)
Affinity DataIC50:  3.40E+3nM. Assay description: Half-maximal inhibition of [125I]CCK-33 binding to cholecystokinin receptor
In DepthDetails ArticlePubMed
TargetGastrin/cholecystokinin type B receptor(Homo sapiens (Human))
Merck Sharp & Dohme Research Laboratories
Curated by ChEMBL
LigandPNGBDBM50019202(7-Chloro-3-(1H-indol-3-ylmethyl)-5-phenyl-1,3-dihy...)
Affinity DataIC50:  3.00E+4nM. Assay description: Half-maximal inhibition of [125I]gastrin binding to guinea pig gastric glands
In DepthDetails ArticlePubMed
LigandPNGBDBM50019202(7-Chloro-3-(1H-indol-3-ylmethyl)-5-phenyl-1,3-dihy...)
Affinity DataIC50:  3.40E+3nM. Assay description: Half-maximal inhibition of [125I]-CCK-33 binding to rat pancreas cholecystokinin receptor
In DepthDetails ArticlePubMed
TargetCholecystokinin receptor type A/Gastrin/cholecystokinin type B receptor(Homo sapiens (Human))
Merck Sharp & Dohme Research Laboratories
Curated by ChEMBL
LigandPNGBDBM50019202(7-Chloro-3-(1H-indol-3-ylmethyl)-5-phenyl-1,3-dihy...)
Affinity DataIC50: >1.00E+5nM. Assay description: Half-maximal inhibition of [125I]CCK-33 binding to cholecystokinin receptor from guinea pig brain tissue
In DepthDetails ArticlePubMed
TargetGastrin/cholecystokinin type B receptor(Homo sapiens (Human))
Merck Sharp & Dohme Research Laboratories
Curated by ChEMBL
LigandPNGBDBM50019202(7-Chloro-3-(1H-indol-3-ylmethyl)-5-phenyl-1,3-dihy...)
Affinity DataIC50:  3.00E+4nM. Assay description: Half-maximal inhibition of binding of [125I]gastrin to guinea pig gastric glands
In DepthDetails ArticlePubMed
TargetCholecystokinin receptor type A(Cavia porcellus)
TBA
Curated by ChEMBL
LigandPNGBDBM50019202(7-Chloro-3-(1H-indol-3-ylmethyl)-5-phenyl-1,3-dihy...)
Affinity DataIC50: >1.00E+5nM. Assay description: Half-maximal inhibition of [125I]CCK-33 binding to guinea pig brain(cortex) cholecystokinin receptor
In DepthDetails ArticlePubMed