BDBM50019239 (R)-2-Chloro-N-(1-methyl-2-oxo-5-phenyl-2,3-dihydro-1H-benzo[e][1,4]diazepin-3-yl)-benzamide::(S)-2-Chloro-N-(1-methyl-2-oxo-5-phenyl-2,3-dihydro-1H-benzo[e][1,4]diazepin-3-yl)-benzamide::2-Chloro-N-(1-methyl-2-oxo-5-phenyl-2,3-dihydro-1H-benzo[e][1,4]diazepin-3-yl)-benzamide::2-Chloro-N-(1-methyl-2-oxo-5-phenyl-2,3-dihydro-1H-benzo[e][1,4]diazepin-3-yl)-benzamide:0.55H2O::CHEMBL432334
SMILES CN1c2ccccc2C(=NC(NC(=O)c2ccccc2Cl)C1=O)c1ccccc1
InChI Key InChIKey=PAUVCXBRYIWFTM-UHFFFAOYSA-N
Data  4 IC50
  Tab Delimited (TSV)   2D SDfile   Computed 3D by Vconf -m prep SDfile
Find this compound or compounds like it in BindingDB:
Activity Spreadsheet -- Enzyme Inhibition Constant Data from BindingDB
Found 4 hits for monomerid = 50019239
TargetGastrin/cholecystokinin type B receptor(Homo sapiens (Human))
Merck Sharp & Dohme Research Laboratories
Curated by ChEMBL
LigandPNGBDBM50019239((R)-2-Chloro-N-(1-methyl-2-oxo-5-phenyl-2,3-dihydr...)
Affinity DataIC50:  3.00E+4nM. Assay description: Half-maximal inhibition of [125I]gastrin binding to guinea pig gastric glands
In DepthDetails ArticlePubMed
TargetCholecystokinin receptor type A/Gastrin/cholecystokinin type B receptor(Homo sapiens (Human))
Merck Sharp & Dohme Research Laboratories
Curated by ChEMBL
LigandPNGBDBM50019239((R)-2-Chloro-N-(1-methyl-2-oxo-5-phenyl-2,3-dihydr...)
Affinity DataIC50: >1.00E+5nM. Assay description: Half-maximal inhibition of [125I]-CCK-8(+) binding to cholecystokinin receptor from guinea pig brain tissue
In DepthDetails ArticlePubMed
TargetCholecystokinin receptor type A(RAT)
University Of Illinois At Chicago
Curated by ChEMBL
LigandPNGBDBM50019239((R)-2-Chloro-N-(1-methyl-2-oxo-5-phenyl-2,3-dihydr...)
Affinity DataIC50:  3.39E+3nM. Assay description: Binding affinity against cholecystokinin type A receptor of rat pancreas
In DepthDetails ArticlePubMed
TargetCholecystokinin receptor type A(RAT)
University Of Illinois At Chicago
Curated by ChEMBL
LigandPNGBDBM50019239((R)-2-Chloro-N-(1-methyl-2-oxo-5-phenyl-2,3-dihydr...)
Affinity DataIC50:  3.40E+3nM. Assay description: Half-maximal inhibition of [125I]CCK-33 binding to cholecystokinin A receptor from rat pancreatic tissue
In DepthDetails ArticlePubMed