BDBM50019300 CHEMBL3289405
SMILES O=C(NCCc1ccccn1)c1cccn2c1nc1cc3ccccc3cc1c2=O
InChI Key InChIKey=ULZAEDZUQQVQJD-UHFFFAOYSA-N
Data  1 IC50
  Tab Delimited (TSV)   2D SDfile   Computed 3D by Vconf -m prep SDfile
Find this compound or compounds like it in BindingDB:
Activity Spreadsheet -- Enzyme Inhibition Constant Data from BindingDB
Found 1 hit for monomerid = 50019300
TargetDNA-directed RNA polymerase I subunit RPA1(Homo sapiens (Human))
Johns Hopkins University School Of Medicine
Curated by ChEMBL
LigandPNGBDBM50019300(CHEMBL3289405)
Affinity DataIC50:  1.58E+4nM. Assay description: Induction of RNA polymerase-1 RPA194 subunit degradation in human U2OS cells after 3 hrs by epifluorescence microscopic analysis
In DepthDetails ArticlePubMed