BDBM50019452 CHEMBL3290689
SMILES Cl.NC(=N)Nc1cccc(Nc2ccc(NC(=N)Nc3ccccc3)cc2)c1
InChI Key InChIKey=QLVBDLFRVXEZHN-UHFFFAOYSA-N
Data  2 IC50
  Tab Delimited (TSV)   2D SDfile   Computed 3D by Vconf -m prep SDfile
Find this compound or compounds like it in BindingDB:
Activity Spreadsheet -- Enzyme Inhibition Constant Data from BindingDB
Found 2 hits for monomerid = 50019452
TargetCasein kinase I isoform delta(Homo sapiens (Human))
Trinity College
Curated by ChEMBL
LigandPNGBDBM50019452(CHEMBL3290689)
Affinity DataIC50: >1.00E+5nM. Assay description: Inhibition of human recombinant casein kinase-1 delta using casein as substrate after 60 mins by kinase-glo luminescence assay
In DepthDetails ArticlePubMed
TargetGlycogen synthase kinase-3 beta(Homo sapiens (Human))
Trinity College
Curated by ChEMBL
LigandPNGBDBM50019452(CHEMBL3290689)
Affinity DataIC50: >1.00E+5nM. Assay description: Inhibition of human recombinant GSK-3 beta after 30 mins by luminescence assay
In DepthDetails ArticlePubMed