BDBM50019473 CHEMBL3290726
SMILES OC(=O)CCc1coc2cc(Cl)c(Oc3ccncc3C(=O)N3CCN(C4CC4)c4ccccc34)cc12
InChI Key InChIKey=FDNYQWLSNDFHBJ-UHFFFAOYSA-N
Data  1 EC50
  Tab Delimited (TSV)   2D SDfile   Computed 3D by Vconf -m prep SDfile
Find this compound or compounds like it in BindingDB:
Activity Spreadsheet -- Enzyme Inhibition Constant Data from BindingDB
Found 1 hit for monomerid = 50019473
TargetG-protein coupled bile acid receptor 1(Homo sapiens (Human))
Chinese Academy Of Sciences
Curated by ChEMBL
LigandPNGBDBM50019473(CHEMBL3290726)
Affinity DataEC50:  675nM. Assay description: Agonist activity at human TGR5 expressed in HEK293 cells co-expressing CRE after 5.5 hrs by luciferase reporter gene assay
In DepthDetails ArticlePubMed