BDBM50019478 CHEMBL3290715
SMILES Clc1cc2occc2cc1Oc1ccncc1C(=O)N1CCN(C2CC2)c2ccccc12
InChI Key InChIKey=UYMILKMRNOZXPJ-UHFFFAOYSA-N
Data  2 EC50
  Tab Delimited (TSV)   2D SDfile   Computed 3D by Vconf -m prep SDfile
Find this compound or compounds like it in BindingDB:
Activity Spreadsheet -- Enzyme Inhibition Constant Data from BindingDB
Found 2 hits for monomerid = 50019478
TargetG-protein coupled bile acid receptor 1(Mus musculus)
Chinese Academy Of Sciences
Curated by ChEMBL
LigandPNGBDBM50019478(CHEMBL3290715)
Affinity DataEC50:  10nM. Assay description: Agonist activity at mouse TGR5 expressed in HEK293 cells co-expressing CRE after 5.5 hrs by luciferase reporter gene assay
In DepthDetails ArticlePubMed
TargetG-protein coupled bile acid receptor 1(Homo sapiens (Human))
Chinese Academy Of Sciences
Curated by ChEMBL
LigandPNGBDBM50019478(CHEMBL3290715)
Affinity DataEC50:  1.40nM. Assay description: Agonist activity at human TGR5 expressed in HEK293 cells co-expressing CRE after 5.5 hrs by luciferase reporter gene assay
In DepthDetails ArticlePubMed