BDBM50019485 CHEMBL3290720
SMILES CCOC(=O)c1coc2cc(Cl)c(Oc3ccncc3C(=O)N3CCN(C4CC4)c4ccccc34)cc12
InChI Key InChIKey=UBILEIIMFLCVCE-UHFFFAOYSA-N
Data  2 EC50
  Tab Delimited (TSV)   2D SDfile   Computed 3D by Vconf -m prep SDfile
Find this compound or compounds like it in BindingDB:
Activity Spreadsheet -- Enzyme Inhibition Constant Data from BindingDB
Found 2 hits for monomerid = 50019485
TargetG-protein coupled bile acid receptor 1(Mus musculus)
Chinese Academy Of Sciences
Curated by ChEMBL
LigandPNGBDBM50019485(CHEMBL3290720)
Affinity DataEC50:  39nM. Assay description: Agonist activity at mouse TGR5 expressed in HEK293 cells co-expressing CRE after 5.5 hrs by luciferase reporter gene assay
In DepthDetails ArticlePubMed
TargetG-protein coupled bile acid receptor 1(Homo sapiens (Human))
Chinese Academy Of Sciences
Curated by ChEMBL
LigandPNGBDBM50019485(CHEMBL3290720)
Affinity DataEC50:  1.70nM. Assay description: Agonist activity at human TGR5 expressed in HEK293 cells co-expressing CRE after 5.5 hrs by luciferase reporter gene assay
In DepthDetails ArticlePubMed