BDBM50019870 CHEMBL3287191
SMILES CCC(=O)n1ccc2cc(ccc12)-c1cccnc1
InChI Key InChIKey=JVYLZWZPCIHMGB-UHFFFAOYSA-N
Data  2 IC50
  Tab Delimited (TSV)   2D SDfile   Computed 3D by Vconf -m prep SDfile
Find this compound or compounds like it in BindingDB:
Activity Spreadsheet -- Enzyme Inhibition Constant Data from BindingDB
Found 2 hits for monomerid = 50019870
TargetCytochrome P450 11B1, mitochondrial(Homo sapiens (Human))
Saarland University
Curated by ChEMBL
LigandPNGBDBM50019870(CHEMBL3287191)
Affinity DataIC50:  736nM. Assay description: Inhibition of human CYP11B1 expressed in hamster V79MZh cells using deoxycorticosterone as substrate
In DepthDetails ArticlePubMed
TargetCytochrome P450 11B2, mitochondrial(Homo sapiens (Human))
Saarland University
Curated by ChEMBL
LigandPNGBDBM50019870(CHEMBL3287191)
Affinity DataIC50:  77nM. Assay description: Inhibition of human CYP11B2 expressed in hamster V79MZh cells using deoxycorticosterone as substrate
In DepthDetails ArticlePubMed