BDBM50019907 CHEMBL3287212
SMILES CC(N1c2scnc2SCC1=O)c1ccc(F)c(OC(F)(F)F)c1
InChI Key InChIKey=HSHNHQXVNDWYCU-UHFFFAOYSA-N
Data  1 IC50
  Tab Delimited (TSV)   2D SDfile   Computed 3D by Vconf -m prep SDfile
Find this compound or compounds like it in BindingDB:
Activity Spreadsheet -- Enzyme Inhibition Constant Data from BindingDB
Found 1 hit for monomerid = 50019907
TargetIntermediate conductance calcium-activated potassium channel protein 4(Homo sapiens (Human))
Temple University School Of Pharmacy
Curated by ChEMBL
LigandPNGBDBM50019907(CHEMBL3287212)
Affinity DataIC50:  60nM. Assay description: Inhibition of human KCa3.1 overexpressed in HEK293 cells assessed as thallium influx preincubated for 15 mins followed by thallium/ionomycin addition...
In DepthDetails ArticlePubMed