BDBM50020203 CHEMBL2369474::D-Ticc(-Cys-Tyr-D-Trp-Lys-Pen-)Thr-NH2
SMILES [H][C@]1(NC(=O)[C@H](CCCN=C(N)N)NC(=O)[C@H](Cc2c[nH]c3ccccc23)NC(=O)[C@H](Cc2ccc(O)cc2)NC(=O)[C@H](CSSC(C)(C)[C@H](NC1=O)C(=O)N[C@@H]([C@@H](C)O)C(N)=O)NC(=O)[C@@H]1Cc2ccccc2CN1)[C@@H](C)O
InChI Key InChIKey=VZDYOAZXFPOIMZ-PFKBBZQESA-N
Data  3 IC50
  Tab Delimited (TSV)   2D SDfile   Computed 3D by Vconf -m prep SDfile
Find this compound or compounds like it in BindingDB:
Activity Spreadsheet -- Enzyme Inhibition Constant Data from BindingDB
Found 3 hits for monomerid = 50020203
TargetMu-type opioid receptor(Rattus norvegicus (rat))
University Of Arizona
Curated by ChEMBL
LigandPNGBDBM50020203(CHEMBL2369474 | D-Ticc(-Cys-Tyr-D-Trp-Lys-Pen-)Thr...)
Affinity DataIC50:  1.27E+3nM. Assay description: Binding affinity in competition with [3H]- CTOP in Opioid receptor mu 1 binding to rat brain membrane
In DepthDetails ArticlePubMed
TargetSomatostatin receptor type 1/2/3/4/5(RAT)
University Of Arizona
Curated by ChEMBL
LigandPNGBDBM50020203(CHEMBL2369474 | D-Ticc(-Cys-Tyr-D-Trp-Lys-Pen-)Thr...)
Affinity DataIC50:  3.43E+4nM. Assay description: Binding affinity in competition with [125I]- CGP-23996 in somatostatin receptor binding to rat brain membrane
In DepthDetails ArticlePubMed
TargetDelta-type opioid receptor(Rattus norvegicus (rat))
University Of Arizona
Curated by ChEMBL
LigandPNGBDBM50020203(CHEMBL2369474 | D-Ticc(-Cys-Tyr-D-Trp-Lys-Pen-)Thr...)
Affinity DataIC50:  1.27E+3nM. Assay description: Binding affinity in competition with [3H]- DPDPE in Opioid receptor delta 1 binding to rat brain membrane
In DepthDetails ArticlePubMed