BDBM50020299 (R-isomer)7-[3,5-Dihydroxy-2-(3-hydroxy-7-phenyl-hept-1-enyl)-cyclopentyl]-hept-5-enoic acid::(S-isomer)7-[3,5-Dihydroxy-2-(3-hydroxy-7-phenyl-hept-1-enyl)-cyclopentyl]-hept-5-enoic acid::CHEMBL88275
SMILES O[C@@H](CCCCc1ccccc1)\C=C\C1[C@H](O)C[C@H](O)[C@@H]1C\C=C/CCCC(O)=O
InChI Key InChIKey=FHWDBURJDRCBLO-HGBYWJASSA-N
Data  2 IC50
  Tab Delimited (TSV)   2D SDfile   Computed 3D by Vconf -m prep SDfile
Find this compound or compounds like it in BindingDB:
Activity Spreadsheet -- Enzyme Inhibition Constant Data from BindingDB
Found 2 hits for monomerid = 50020299
TargetProstaglandin F2-alpha receptor(BOVINE)
University Of Kentucky
Curated by ChEMBL
LigandPNGBDBM50020299((R-isomer)7-[3,5-Dihydroxy-2-(3-hydroxy-7-phenyl-h...)
Affinity DataIC50:  240nM. Assay description: Binding potency towards PGF-2 alpha receptor (competitive binding) with natural [3H]-PGF 2 alpha in bovine corpora lutea plasma membranes (BCLM)
In DepthDetails ArticlePubMed
TargetProstaglandin F2-alpha receptor(Homo sapiens (Human))
University Of Kentucky
Curated by ChEMBL
LigandPNGBDBM50020299((R-isomer)7-[3,5-Dihydroxy-2-(3-hydroxy-7-phenyl-h...)
Affinity DataIC50:  32nM. Assay description: Binding potency towards PGF-2 alpha receptor (competitive binding) with natural [3H]-PGF 2 alpha in ovine luteal cells (OLC)
In DepthDetails ArticlePubMed