BDBM50020326 CHEMBL157596::[2-(2-Acetoxy-3-octadecyloxy-propoxycarbonylamino)-ethyl]-trimethyl-ammonium; bromide
SMILES CCCCCCCCCCCCCCCCCCOCC(COC(=O)NCC[N+](C)(C)C)OC(C)=O
InChI Key InChIKey=LCCJLNZORUKNCP-UHFFFAOYSA-O
Data  1 IC50
  Tab Delimited (TSV)   2D SDfile   Computed 3D by Vconf -m prep SDfile
Find this compound or compounds like it in BindingDB:
Activity Spreadsheet -- Enzyme Inhibition Constant Data from BindingDB
Found 1 hit for monomerid = 50020326
TargetPlatelet-activating factor receptor(Cavia porcellus)
Takeda Chemical Industries
Curated by ChEMBL
LigandPNGBDBM50020326(CHEMBL157596 | [2-(2-Acetoxy-3-octadecyloxy-propox...)
Affinity DataIC50:  8.40E+3nM. Assay description: Inhibition of rabbit platelet aggregation induced by platelet activating factor (PAF)
In DepthDetails ArticlePubMed