BDBM50020391 1-Benzyl-3-[2-(1-ethoxycarbonyl-3-phenyl-propylamino)-propionyl]-2-oxo-imidazolidine-4-carboxylic acid::CHEMBL328847
SMILES CCOC(=O)[C@H](CCc1ccccc1)N[C@@H](C)C(=O)N1[C@@H](CN(Cc2ccccc2)C1=O)C(O)=O
InChI Key InChIKey=YGPISQLKIFLHNT-NYVOZVTQSA-N
Data  1 IC50
  Tab Delimited (TSV)   2D SDfile   Computed 3D by Vconf -m prep SDfile
Find this compound or compounds like it in BindingDB:
Activity Spreadsheet -- Enzyme Inhibition Constant Data from BindingDB
Found 1 hit for monomerid = 50020391
TargetAngiotensin-converting enzyme(Homo sapiens (Human))
Tanabe Seiyaku
Curated by ChEMBL
LigandPNGBDBM50020391(1-Benzyl-3-[2-(1-ethoxycarbonyl-3-phenyl-propylami...)
Affinity DataIC50:  7.90E+3nM. Assay description: Inhibition of Angiotensin I converting enzyme from pig renal cortex, hippuryl-histidyl-leucine as substrate
In DepthDetails ArticlePubMed