BDBM50020592 CHEMBL3286437
SMILES Cc1ccc2c(c1)oc1c(nn(-c3ccc(Cl)cc3Cl)c21)C(=O)NN1CCCC1
InChI Key InChIKey=DABWKDFIQGVZIN-UHFFFAOYSA-N
Data  2 KI
  Tab Delimited (TSV)   2D SDfile   Computed 3D by Vconf -m prep SDfile
Find this compound or compounds like it in BindingDB:
Activity Spreadsheet -- Enzyme Inhibition Constant Data from BindingDB
Found 2 hits for monomerid = 50020592
TargetCannabinoid receptor 2(MOUSE)
Universit£
Curated by ChEMBL
LigandPNGBDBM50020592(CHEMBL3286437)
Affinity DataKi:  30nM. Assay description: Displacement of [3H]-CP-55,940 from CB2 receptor in CD1 mouse spleen homogenate after 1 hr by liquid scintillation counting analysis
In DepthDetails ArticlePubMed
TargetCannabinoid receptor 1(Mus musculus (Mouse))
Universit£
Curated by ChEMBL
LigandPNGBDBM50020592(CHEMBL3286437)
Affinity DataKi:  2.72E+3nM. Assay description: Displacement of [3H]-CP-55,940 from CB1 receptor in CD1 mouse cerebellum-less brain homogenate after 1 hr by liquid scintillation counting analysis
In DepthDetails ArticlePubMed