BDBM50020700 1-(2,5-Dibenzyl-11-carbamoylmethyl-8-isopropyl-3,6,9,12,18-pentaoxo-1,4,7,10,13pentaaza-cyclooctadecane-14-carbonyl)-pyrrolidine-2-carboxylic acid [1-(carbamoylmethyl-carbamoyl)-4-guanidino-butyl]-amide::CHEMBL2371441
SMILES [H][C@@]([#6]-[#6]-[#6]\[#7]=[#6](\[#7])-[#7])([#7]-[#6](=O)[C@]1([H])[#6]-[#6]-[#6]-[#7]1-[#6](=O)[C@]1([H])[#6]-[#6]-[#6]-[#6](=O)-[#7]-[#6@@H](-[#6]-c2ccccc2)-[#6](=O)-[#7]-[#6@@H](-[#6]-c2ccccc2)-[#6](=O)-[#7]-[#6@@H](-[#6](-[#6])-[#6])-[#6](=O)-[#7][C@@]([H])([#6]-[#6](-[#7])=O)[#6](=O)-[#7]1)[#6](=O)-[#7]-[#6]-[#6](-[#7])=O
InChI Key InChIKey=USZGVGQIVCXWJD-CDKUOFBKSA-N
Data  1 KI
  Tab Delimited (TSV)   2D SDfile   Computed 3D by Vconf -m prep SDfile
Find this compound or compounds like it in BindingDB:
Activity Spreadsheet -- Enzyme Inhibition Constant Data from BindingDB
Found 1 hit for monomerid = 50020700
TargetVasopressin V2 receptor(Sus scrofa)
Smith Kline And French Laboratories
Curated by ChEMBL
LigandPNGBDBM50020700(1-(2,5-Dibenzyl-11-carbamoylmethyl-8-isopropyl-3,6...)
Affinity DataKi:  7.00E+3nM. Assay description: Inhibition of LVP-sensitive adenylate cyclase in a pig renal medullary preparation
In DepthDetails ArticlePubMed