BDBM50020963 1,3-Diallyl-8-(2-amino-4-chloro-phenyl)-3,7-dihydro-purine-2,6-dione::CHEMBL11410
SMILES Nc1cc(Cl)ccc1-c1nc2n(CC=C)c(=O)n(CC=C)c(=O)c2[nH]1
InChI Key InChIKey=LEYUNGYTDRALAW-UHFFFAOYSA-N
Data  1 IC50
  Tab Delimited (TSV)   2D SDfile   Computed 3D by Vconf -m prep SDfile
Find this compound or compounds like it in BindingDB:
Activity Spreadsheet -- Enzyme Inhibition Constant Data from BindingDB
Found 1 hit for monomerid = 50020963
TargetAdenosine receptor A1(BOVINE)
TBA
Curated by ChEMBL
LigandPNGBDBM50020963(1,3-Diallyl-8-(2-amino-4-chloro-phenyl)-3,7-dihydr...)
Affinity DataIC50:  0.800nM. Assay description: Binding affinity against bovine brain adenosine A1 receptor by using N6-[3H]- cyclohexyladenosineChecked by Author
In DepthDetails ArticlePubMed