BDBM50021098 CHEMBL3287640
SMILES Fc1ccc(cc1)C(=O)NC1CCCC(C1)NCc1c[nH]c2ccccc12
InChI Key InChIKey=RJEOWQOMOYEZIE-UHFFFAOYSA-N
Data  1 KI
  Tab Delimited (TSV)   2D SDfile   Computed 3D by Vconf -m prep SDfile
Find this compound or compounds like it in BindingDB:
Activity Spreadsheet -- Enzyme Inhibition Constant Data from BindingDB
Found 1 hit for monomerid = 50021098
TargetSomatostatin receptor type 3(Homo sapiens (Human))
Merck Research Laboratories
Curated by ChEMBL
LigandPNGBDBM50021098(CHEMBL3287640)
Affinity DataKi: >1.13E+3nM. Assay description: Displacement of [125I]SS14 from human SST3 expressed in CHO membrane after 60 to 90 mins by scintillation counting
In DepthDetails ArticlePubMed