BDBM50021150 2-(1-Carboxymethyl-2-oxo-2,3,4,5-tetrahydro-1H-benzo[b]azepin-3-ylamino)-3-phenyl-propionic acid::CHEMBL290802
SMILES OC(=O)CN1c2ccccc2CC[C@H](N[C@@H](Cc2ccccc2)C(O)=O)C1=O
InChI Key InChIKey=VUCYCNRONPBINV-IRXDYDNUSA-N
Data  1 IC50
  Tab Delimited (TSV)   2D SDfile   Computed 3D by Vconf -m prep SDfile
Find this compound or compounds like it in BindingDB:
Activity Spreadsheet -- Enzyme Inhibition Constant Data from BindingDB
Found 1 hit for monomerid = 50021150
TargetAngiotensin-converting enzyme(Homo sapiens (Human))
TBA
Curated by ChEMBL
LigandPNGBDBM50021150(2-(1-Carboxymethyl-2-oxo-2,3,4,5-tetrahydro-1H-ben...)
Affinity DataIC50:  8.5nM. Assay description: In vitro inhibitory activity against Angiotensin I converting enzyme
In DepthDetails ArticlePubMed