BDBM50021158 1-[4-Carboxy-4-(2,6-diamino-hexanoylamino)-butyryl]-2,3-dihydro-1H-indole-2-carboxylic acid::CHEMBL43793
SMILES NCCCCC(N)C(=O)N[C@H](CCC(=O)N1[C@@H](Cc2ccccc12)C(O)=O)C(O)=O
InChI Key InChIKey=FGUMBYIWFAVINB-VVRWDSKXSA-N
Data  1 IC50
  Tab Delimited (TSV)   2D SDfile   Computed 3D by Vconf -m prep SDfile
Find this compound or compounds like it in BindingDB:
Activity Spreadsheet -- Enzyme Inhibition Constant Data from BindingDB
Found 1 hit for monomerid = 50021158
TargetAngiotensin-converting enzyme(Oryctolagus cuniculus)
TBA
Curated by ChEMBL
LigandPNGBDBM50021158(1-[4-Carboxy-4-(2,6-diamino-hexanoylamino)-butyryl...)
Affinity DataIC50:  188nM. Assay description: In vitro inhibition of angiotensin I converting enzyme from rabbit lung
In DepthDetails ArticlePubMed