BDBM50021220 CHEMBL555549::[3-(3,4-Dichloro-phenyl)-indan-1-yl]-diethyl-amine; hydrochloride
SMILES CCN(CC)C1CC(c2ccccc12)c1ccc(Cl)c(Cl)c1
InChI Key InChIKey=CMPKTAXJJJLOGY-UHFFFAOYSA-N
Data  6 IC50
  Tab Delimited (TSV)   2D SDfile   Computed 3D by Vconf -m prep SDfile
Find this compound or compounds like it in BindingDB:
Activity Spreadsheet -- Enzyme Inhibition Constant Data from BindingDB
Found 6 hits for monomerid = 50021220
TargetTransporter(Rattus norvegicus)
TBA
Curated by ChEMBL
LigandPNGBDBM50021220(CHEMBL555549 | [3-(3,4-Dichloro-phenyl)-indan-1-yl...)
Affinity DataIC50:  0.560nM. Assay description: Inhibition of noradrenaline uptake in rat synaptosomal fraction
In DepthDetails ArticlePubMed
TargetSodium-dependent serotonin transporter(Rattus norvegicus (rat))
TBA
Curated by ChEMBL
LigandPNGBDBM50021220(CHEMBL555549 | [3-(3,4-Dichloro-phenyl)-indan-1-yl...)
Affinity DataIC50:  2.80nM. Assay description: Inhibition of 5-HT uptake in rat synaptosomal fraction
In DepthDetails ArticlePubMed
TargetSodium-dependent serotonin transporter(Rattus norvegicus (rat))
TBA
Curated by ChEMBL
LigandPNGBDBM50021220(CHEMBL555549 | [3-(3,4-Dichloro-phenyl)-indan-1-yl...)
Affinity DataIC50:  2.80nM. Assay description: Inhibition of 5-HT uptake in rat synaptosomal fraction
In DepthDetails ArticlePubMed
TargetSodium-dependent dopamine transporter(Rattus norvegicus (rat))
TBA
Curated by ChEMBL
LigandPNGBDBM50021220(CHEMBL555549 | [3-(3,4-Dichloro-phenyl)-indan-1-yl...)
Affinity DataIC50:  2.10nM. Assay description: Inhibition of noradrenaline uptake in rat synaptosomal fraction
In DepthDetails ArticlePubMed
TargetTransporter(Rattus norvegicus)
TBA
Curated by ChEMBL
LigandPNGBDBM50021220(CHEMBL555549 | [3-(3,4-Dichloro-phenyl)-indan-1-yl...)
Affinity DataIC50:  0.560nM. Assay description: Inhibition of dopamine uptake in rat synaptosomal fraction
In DepthDetails ArticlePubMed
TargetSodium-dependent dopamine transporter(Rattus norvegicus (rat))
TBA
Curated by ChEMBL
LigandPNGBDBM50021220(CHEMBL555549 | [3-(3,4-Dichloro-phenyl)-indan-1-yl...)
Affinity DataIC50:  2.10nM. Assay description: Inhibition of dopamine uptake in rat synaptosomal fraction
In DepthDetails ArticlePubMed