BDBM50021242 CHEMBL553590::[3-(3,4-Dichloro-phenyl)-indan-1-yl]-propyl-amine; hydrochloride
SMILES CCCNC1CC(c2ccccc12)c1ccc(Cl)c(Cl)c1
InChI Key InChIKey=FSUVEHUIVCMLNZ-UHFFFAOYSA-N
Data  3 IC50
  Tab Delimited (TSV)   2D SDfile   Computed 3D by Vconf -m prep SDfile
Find this compound or compounds like it in BindingDB:
Activity Spreadsheet -- Enzyme Inhibition Constant Data from BindingDB
Found 3 hits for monomerid = 50021242
TargetTransporter(Rattus norvegicus)
TBA
Curated by ChEMBL
LigandPNGBDBM50021242(CHEMBL553590 | [3-(3,4-Dichloro-phenyl)-indan-1-yl...)
Affinity DataIC50:  0.660nM. Assay description: Inhibition of noradrenaline uptake in rat synaptosomal fraction
In DepthDetails ArticlePubMed
TargetSodium-dependent serotonin transporter(Rattus norvegicus (rat))
TBA
Curated by ChEMBL
LigandPNGBDBM50021242(CHEMBL553590 | [3-(3,4-Dichloro-phenyl)-indan-1-yl...)
Affinity DataIC50:  150nM. Assay description: Inhibition of 5-HT uptake in rat synaptosomal fraction
In DepthDetails ArticlePubMed
TargetSodium-dependent dopamine transporter(Rattus norvegicus (rat))
TBA
Curated by ChEMBL
LigandPNGBDBM50021242(CHEMBL553590 | [3-(3,4-Dichloro-phenyl)-indan-1-yl...)
Affinity DataIC50:  6.60nM. Assay description: Inhibition of dopamine uptake in rat synaptosomal fraction
In DepthDetails ArticlePubMed