BDBM50021262 4,5,6,7-tetrahydroisoxazolo[4,5-c]pyridin-5-ium-3-olate::4,5,6,7-tetrahydroisoxazolo[4,5-c]pyridin-5-ium-3-olate(THPO)
SMILES O=c1[n-]oc2CC[NH2+]Cc12
InChI Key InChIKey=SXXLKZCNJHJYFL-UHFFFAOYSA-N
Data  2 IC50
  Tab Delimited (TSV)   2D SDfile   Computed 3D by Vconf -m prep SDfile
Find this compound or compounds like it in BindingDB:
Activity Spreadsheet -- Enzyme Inhibition Constant Data from BindingDB
Found 2 hits for monomerid = 50021262
LigandPNGBDBM50021262(4,5,6,7-tetrahydroisoxazolo[4,5-c]pyridin-5-ium-3-...)
Affinity DataIC50:  1.60E+5nM. Assay description: In vitro effect on GABA uptake in a crude preparation of synaptosomes from rat brain
In DepthDetails ArticlePubMed
TargetGamma-aminobutyric acid receptor subunit gamma-1(Rattus norvegicus)
TBA
Curated by ChEMBL
LigandPNGBDBM50021262(4,5,6,7-tetrahydroisoxazolo[4,5-c]pyridin-5-ium-3-...)
Affinity DataIC50:  7.20E+4nM. Assay description: In vitro affinity for GABA binding sites on purified synaptic membranes from rat brain
In DepthDetails ArticlePubMed