BDBM50021386 CHEMBL3289584
SMILES NCCC(N1CCC(CC1)C(c1ccccc1)c1ccccc1)C(=O)NCc1ccccc1
InChI Key InChIKey=XHHULPRRINQQSR-UHFFFAOYSA-N
Data  1 KI  4 IC50
  Tab Delimited (TSV)   2D SDfile   Computed 3D by Vconf -m prep SDfile
Find this compound or compounds like it in BindingDB:
Activity Spreadsheet -- Enzyme Inhibition Constant Data from BindingDB
Found 5 hits for monomerid = 50021386
TargetSodium- and chloride-dependent GABA transporter 1(Rattus norvegicus)
Jagiellonian University Medical College
Curated by ChEMBL
LigandPNGBDBM50021386(CHEMBL3289584)
Affinity DataKi:  3.24E+4nM. Assay description: Displacement of NO711 from mouse GAT1 expressed in HEK293 cells by LC-MS/MS analysis
In DepthDetails ArticlePubMed
TargetSodium- and chloride-dependent betaine transporter(Mus musculus)
Jagiellonian University Medical College
Curated by ChEMBL
LigandPNGBDBM50021386(CHEMBL3289584)
Affinity DataIC50:  1.20E+4nM. Assay description: Inhibition of mouse GAT2 expressed in HEK293 cells assessed as decrease in [3H]GABA uptake
In DepthDetails ArticlePubMed
TargetSodium- and chloride-dependent GABA transporter 3(Mus musculus)
Jagiellonian University Medical College
Curated by ChEMBL
LigandPNGBDBM50021386(CHEMBL3289584)
Affinity DataIC50:  2.00E+4nM. Assay description: Inhibition of mouse GAT4 expressed in HEK293 cells assessed as decrease in [3H]GABA uptake
In DepthDetails ArticlePubMed
TargetSodium- and chloride-dependent GABA transporter 1(Rattus norvegicus)
Jagiellonian University Medical College
Curated by ChEMBL
LigandPNGBDBM50021386(CHEMBL3289584)
Affinity DataIC50:  1.95E+4nM. Assay description: Inhibition of mouse GAT1 expressed in HEK293 cells assessed as decrease in [3H]GABA uptake
In DepthDetails ArticlePubMed
TargetSodium- and chloride-dependent GABA transporter 2(Mus musculus)
Jagiellonian University Medical College
Curated by ChEMBL
LigandPNGBDBM50021386(CHEMBL3289584)
Affinity DataIC50:  2.04E+4nM. Assay description: Inhibition of mouse GAT3 expressed in HEK293 cells assessed as decrease in [3H]GABA uptake
In DepthDetails ArticlePubMed