BDBM50021526 (S,S,S) 2-{2-[(1-Ethoxycarbonyl-3-phenyl-propyl)-methyl-amino]-propionyl}-1,2,3,4-tetrahydro-isoquinoline-3-carboxylic acid::CHEMBL291552
SMILES CCOC(=O)C(CCc1ccccc1)N(C)C(C)C(=O)N1Cc2ccccc2CC1C(O)=O
InChI Key InChIKey=IPBPBZKYCUFDQW-UHFFFAOYSA-N
Data  1 IC50
  Tab Delimited (TSV)   2D SDfile   Computed 3D by Vconf -m prep SDfile
Find this compound or compounds like it in BindingDB:
Activity Spreadsheet -- Enzyme Inhibition Constant Data from BindingDB
Found 1 hit for monomerid = 50021526
TargetAngiotensin-converting enzyme(Homo sapiens (Human))
TBA
Curated by ChEMBL
LigandPNGBDBM50021526((S,S,S) 2-{2-[(1-Ethoxycarbonyl-3-phenyl-propyl)-m...)
Affinity DataIC50: >1.00E+4nM. Assay description: Inhibition of guinea pig angiotensin I converting enzyme
In DepthDetails ArticlePubMed