BDBM50021653 CHEMBL3297759
SMILES NC[C@@H](NC(=O)C[C@H]1CNC(=O)c2cc(cn12)-c1cccc(F)c1)C1CCCCC1
InChI Key InChIKey=MSOLNCSVZOTSMV-VQTJNVASSA-N
Data  2 IC50
  Tab Delimited (TSV)   2D SDfile   Computed 3D by Vconf -m prep SDfile
Find this compound or compounds like it in BindingDB:
Activity Spreadsheet -- Enzyme Inhibition Constant Data from BindingDB
Found 2 hits for monomerid = 50021653
TargetSerine/threonine-protein kinase pim-2(Homo sapiens (Human))
Nerviano Medical Sciences
Curated by ChEMBL
LigandPNGBDBM50021653(CHEMBL3297759)
Affinity DataIC50:  275nM. Assay description: Inhibition of human PIM2 using ARK-RERTYSFGHHA as substrate incubated for 60 mins prior to substrate addition by topcount scintillation counting anal...
In DepthDetails ArticlePubMed
TargetSerine/threonine-protein kinase pim-1(Homo sapiens (Human))
Nerviano Medical Sciences
Curated by ChEMBL
LigandPNGBDBM50021653(CHEMBL3297759)
Affinity DataIC50:  12nM. Assay description: Inhibition of human PIM1 using ARK-RERTYSFGHHA as substrate incubated for 60 mins prior to substrate addition by topcount scintillation counting anal...
In DepthDetails ArticlePubMed