BDBM50021799 (S)1-(3-Acetylsulfanyl-propionyl)-octahydro-indole-2-carboxylic acid::1-(3-Acetylsulfanyl-propionyl)-octahydro-indole-2-carboxylic acid::CHEMBL360469
SMILES CC(=O)SCCC(=O)N1[C@H]2CCCC[C@H]2C[C@H]1C(O)=O
InChI Key InChIKey=OTDMGYOSNTZOEM-SRVKXCTJSA-N
Data  2 IC50
  Tab Delimited (TSV)   2D SDfile   Computed 3D by Vconf -m prep SDfile
Find this compound or compounds like it in BindingDB:
Activity Spreadsheet -- Enzyme Inhibition Constant Data from BindingDB
Found 2 hits for monomerid = 50021799
TargetAngiotensin-converting enzyme(Rattus norvegicus)
TBA
Curated by ChEMBL
LigandPNGBDBM50021799((S)1-(3-Acetylsulfanyl-propionyl)-octahydro-indole...)
Affinity DataIC50:  480nM. Assay description: Inhibition of rat Angiotensin I converting enzyme (ACE), using Hip-Gly-Gly as synthetic substrate.
In DepthDetails ArticlePubMed
TargetAngiotensin-converting enzyme(Rattus norvegicus)
TBA
Curated by ChEMBL
LigandPNGBDBM50021799((S)1-(3-Acetylsulfanyl-propionyl)-octahydro-indole...)
Affinity DataIC50:  480nM. Assay description: Inhibition of rat Angiotensin I converting enzyme (ACE), using Hip-Gly-Gly as synthetic substrate.
In DepthDetails ArticlePubMed