BDBM50022396 7-trifluoromethylspiro[3,4-dihydro-2H-chromene-4,4'-(tetrahydro-1'H-imidazole)]-2',5'-dione::CHEMBL81109
SMILES FC(F)(F)c1ccc2c(OCCC22NC(=O)NC2=O)c1
InChI Key InChIKey=BJHAKSQNTPXVCV-UHFFFAOYSA-N
Data  1 IC50
  Tab Delimited (TSV)   2D SDfile   Computed 3D by Vconf -m prep SDfile
Find this compound or compounds like it in BindingDB:
Activity Spreadsheet -- Enzyme Inhibition Constant Data from BindingDB
Found 1 hit for monomerid = 50022396
TargetAldo-keto reductase family 1 member B1 [K65Q](Bos taurus (Cattle))
Pfizer
Curated by ChEMBL
LigandPNGBDBM50022396(7-trifluoromethylspiro[3,4-dihydro-2H-chromene-4,4...)
Affinity DataIC50:  1.00E+3nM. Assay description: In vitro inhibition of partially purified calf lens aldose reductase
In DepthDetails ArticlePubMed