BDBM50022406 6-chlorospiro[3,4-dihydro-2H-chromene-4,4'-(tetrahydro-1'H-imidazole)]-2'-one1/2H2O::CHEMBL78821
SMILES Clc1ccc2OCCC3(CNC(=O)N3)c2c1
InChI Key InChIKey=DCDSPCATMOZRBM-UHFFFAOYSA-N
Data  1 IC50
  Tab Delimited (TSV)   2D SDfile   Computed 3D by Vconf -m prep SDfile
Find this compound or compounds like it in BindingDB:
Activity Spreadsheet -- Enzyme Inhibition Constant Data from BindingDB
Found 1 hit for monomerid = 50022406
TargetAldo-keto reductase family 1 member B1 [K65Q](Bos taurus (Cattle))
Pfizer
Curated by ChEMBL
LigandPNGBDBM50022406(6-chlorospiro[3,4-dihydro-2H-chromene-4,4'-(tetrah...)
Affinity DataIC50:  1.00E+4nM. Assay description: In vitro inhibition of partially purified calf lens aldose reductase
In DepthDetails ArticlePubMed