BDBM50022421 6-(tert-butyl)spiro[3,4-dihydro-2H-chromene-4,4'-(tetrahydro-1'H-imidazole)]-2',5'-dione(0.5C6H6)::CHEMBL78662
SMILES CC(C)(C)c1ccc2OCCC3(NC(=O)NC3=O)c2c1
InChI Key InChIKey=OQUARXOMEMKTOI-UHFFFAOYSA-N
Data  1 IC50
  Tab Delimited (TSV)   2D SDfile   Computed 3D by Vconf -m prep SDfile
Find this compound or compounds like it in BindingDB:
Activity Spreadsheet -- Enzyme Inhibition Constant Data from BindingDB
Found 1 hit for monomerid = 50022421
TargetAldo-keto reductase family 1 member B1 [K65Q](Bos taurus (Cattle))
Pfizer
Curated by ChEMBL
LigandPNGBDBM50022421(6-(tert-butyl)spiro[3,4-dihydro-2H-chromene-4,4'-(...)
Affinity DataIC50:  1.00E+5nM. Assay description: Inhibition of partially purified calf lens aldose reductase; value ranges from 10E-4 to 10e-5 M
In DepthDetails ArticlePubMed