BDBM50022422 6-methylsulfanylspiro[3,4-dihydro-2H-chromene-4,4'-(tetrahydro-1'H-imidazole)]-2',5'-dione::CHEMBL79199
SMILES CSc1ccc2OCCC3(NC(=O)NC3=O)c2c1
InChI Key InChIKey=DPQJRPUUWODQCY-UHFFFAOYSA-N
Data  1 IC50
  Tab Delimited (TSV)   2D SDfile   Computed 3D by Vconf -m prep SDfile
Find this compound or compounds like it in BindingDB:
Activity Spreadsheet -- Enzyme Inhibition Constant Data from BindingDB
Found 1 hit for monomerid = 50022422
TargetAldo-keto reductase family 1 member B1 [K65Q](Bos taurus (Cattle))
Pfizer
Curated by ChEMBL
LigandPNGBDBM50022422(6-methylsulfanylspiro[3,4-dihydro-2H-chromene-4,4'...)
Affinity DataIC50:  1.00E+3nM. Assay description: In vitro inhibition of partially purified calf lens aldose reductase
In DepthDetails ArticlePubMed