BDBM50022434 CHEMBL81601::spiro[tetrahydro-1H-imidazole-4,4'-(3',4'-dihydro-2'H-pyrano[2,3-f]quinoline)]-2,5-dione
SMILES O=C1NC(=O)C2(CCOc3c2ccc2ncccc32)N1
InChI Key InChIKey=BNENFSYOXWSNOV-UHFFFAOYSA-N
Data  1 IC50
  Tab Delimited (TSV)   2D SDfile   Computed 3D by Vconf -m prep SDfile
Find this compound or compounds like it in BindingDB:
Activity Spreadsheet -- Enzyme Inhibition Constant Data from BindingDB
Found 1 hit for monomerid = 50022434
TargetAldo-keto reductase family 1 member B1 [K65Q](Bos taurus (Cattle))
Pfizer
Curated by ChEMBL
LigandPNGBDBM50022434(CHEMBL81601 | spiro[tetrahydro-1H-imidazole-4,4'-(...)
Affinity DataIC50:  1.00E+3nM. Assay description: In vitro inhibitory activity towards partially purified calf lens aldose reductase; value ranges from 10E-6 - 10E-7
In DepthDetails ArticlePubMed