BDBM50022438 3,4-dihydro-2H,2'H,4'H-spiro[naphthalene-1,5'-[1,3]oxazolidine]-2',4'-dione::CHEMBL285628::spiro[1,2,3,4-tetrahydronaphthalene-1,5'-(tetrahydro[1,3]oxazolane)]-2',4'-dione
SMILES OC1=NC(=O)C2(CCCc3ccccc23)O1
InChI Key InChIKey=SOKLCOPCKATUMT-UHFFFAOYSA-N
Data  2 IC50
  Tab Delimited (TSV)   2D SDfile   Computed 3D by Vconf -m prep SDfile
Find this compound or compounds like it in BindingDB:
Activity Spreadsheet -- Enzyme Inhibition Constant Data from BindingDB
Found 2 hits for monomerid = 50022438
TargetAldo-keto reductase family 1 member B1 [K65Q](Bos taurus (Cattle))
Pfizer
Curated by ChEMBL
LigandPNGBDBM50022438(3,4-dihydro-2H,2'H,4'H-spiro[naphthalene-1,5'-[1,3...)
Affinity DataIC50:  1.00E+4nM. Assay description: In vitro inhibition of partially purified calf lens aldose reductase
In DepthDetails ArticlePubMed
TargetAldo-keto reductase family 1 member B1 [K65Q](Bos taurus (Cattle))
Pfizer
Curated by ChEMBL
LigandPNGBDBM50022438(3,4-dihydro-2H,2'H,4'H-spiro[naphthalene-1,5'-[1,3...)
Affinity DataIC50:  1.00E+5nM. Assay description: Inhibitory concentration was determined against partially purified calf lens aldose reductase using glyceraldehyde as a substrate
In DepthDetails ArticlePubMed