BDBM50022450 1,3-diazaspiro[4.5]decane-2,4-dione::CHEMBL79885
SMILES O=C1NC(=O)C2(CCCCC2)N1
InChI Key InChIKey=NERNEXMEYQFFHU-UHFFFAOYSA-N
Data  1 IC50
  Tab Delimited (TSV)   2D SDfile   Computed 3D by Vconf -m prep SDfile
Find this compound or compounds like it in BindingDB:
Activity Spreadsheet -- Enzyme Inhibition Constant Data from BindingDB
Found 1 hit for monomerid = 50022450
TargetAldo-keto reductase family 1 member B1 [K65Q](Bos taurus (Cattle))
Pfizer
Curated by ChEMBL
LigandPNGBDBM50022450(1,3-diazaspiro[4.5]decane-2,4-dione | CHEMBL79885)
Affinity DataIC50:  1.00E+5nM. Assay description: In vitro inhibition of partially purified calf lens aldose reductase
In DepthDetails ArticlePubMed