BDBM50022462 5',6'-dimethoxyspiro[tetrahydro-1H-imidazole-4,1'-(2',3'-dihydro-1'H-indene)]-2,5-dione::CHEMBL81032
SMILES COc1cc2CCC3(NC(=O)NC3=O)c2cc1OC
InChI Key InChIKey=OQTPNUDWDGWHBO-UHFFFAOYSA-N
Data  1 IC50
  Tab Delimited (TSV)   2D SDfile   Computed 3D by Vconf -m prep SDfile
Find this compound or compounds like it in BindingDB:
Activity Spreadsheet -- Enzyme Inhibition Constant Data from BindingDB
Found 1 hit for monomerid = 50022462
TargetAldo-keto reductase family 1 member B1 [K65Q](Bos taurus (Cattle))
Pfizer
Curated by ChEMBL
LigandPNGBDBM50022462(5',6'-dimethoxyspiro[tetrahydro-1H-imidazole-4,1'-...)
Affinity DataIC50:  1.00E+4nM. Assay description: In vitro inhibition of partially purified calf lens aldose reductase; value ranges from 10E-5 to 10E-6
In DepthDetails ArticlePubMed