BDBM50022499 7-methoxyspiro[3,4-dihydro-2H-benzo[h]chromene-4,4'-(tetrahydro-1'H-imidazole)]-2',5'-dione::CHEMBL309998
SMILES COc1cccc2c3OCCC4(NC(=O)NC4=O)c3ccc12
InChI Key InChIKey=UUSHVFLXLPNAAP-UHFFFAOYSA-N
Data  1 IC50
  Tab Delimited (TSV)   2D SDfile   Computed 3D by Vconf -m prep SDfile
Find this compound or compounds like it in BindingDB:
Activity Spreadsheet -- Enzyme Inhibition Constant Data from BindingDB
Found 1 hit for monomerid = 50022499
TargetAldo-keto reductase family 1 member B1 [K65Q](Bos taurus (Cattle))
Pfizer
Curated by ChEMBL
LigandPNGBDBM50022499(7-methoxyspiro[3,4-dihydro-2H-benzo[h]chromene-4,4...)
Affinity DataIC50:  100nM. Assay description: In vitro inhibition of partially purified calf lens aldose reductase
In DepthDetails ArticlePubMed