BDBM50022896 Boc-Pro-Phe-His-Sta-Ile-Amp::CHEMBL422190
SMILES CC[C@H](C)[C@H](NC(=O)CC(O)C(N)CC(C)CNC(=O)[C@H](Cc1cnc[nH]1)NC(=O)[C@H](Cc1ccccc1)NC(=O)[C@@H]1CCCN1C(=O)OC(C)(C)C)C(=O)NCc1ccccn1
InChI Key InChIKey=IFVRMXRXQKVDCE-BTQAAEOHSA-N
Data  1 IC50
  Tab Delimited (TSV)   2D SDfile   Computed 3D by Vconf -m prep SDfile
Find this compound or compounds like it in BindingDB:
Activity Spreadsheet -- Enzyme Inhibition Constant Data from BindingDB
Found 1 hit for monomerid = 50022896
TargetRenin(Homo sapiens (Human))
Upjohn
Curated by ChEMBL
LigandPNGBDBM50022896(Boc-Pro-Phe-His-Sta-Ile-Amp | CHEMBL422190)
Affinity DataIC50:  4.10E+3nM. Assay description: Inhibition of Human plasma renin
In DepthDetails ArticlePubMed