BDBM50023083 1N-[2-methyl-1-(2-pyridylmethylcarbamoyl)butyl]-4-[1-(1-amino-t-butyloxycarbonyl-2-phenylethylcarboxamido)-2-(1H-5-imidazolyl)ethylcarboxamido]-2,2-difluoro-3-hydroxy-6-methylheptanamide::CHEMBL57399
SMILES CC[C@H](C)[C@H](NC(=O)C(F)(F)[C@@H](O)[C@H](CC(C)C)NC(=O)[C@H](Cc1cnc[nH]1)NC(=O)[C@H](Cc1ccccc1)NC(=O)OC(C)(C)C)C(=O)NCc1ccccn1
InChI Key InChIKey=CPUSLIQWJPPCAC-YXKTVTGNSA-N
Data  1 IC50
  Tab Delimited (TSV)   2D SDfile   Computed 3D by Vconf -m prep SDfile
Find this compound or compounds like it in BindingDB:
Activity Spreadsheet -- Enzyme Inhibition Constant Data from BindingDB
Found 1 hit for monomerid = 50023083
TargetRenin(Homo sapiens (Human))
Upjohn
Curated by ChEMBL
LigandPNGBDBM50023083(1N-[2-methyl-1-(2-pyridylmethylcarbamoyl)butyl]-4-...)
Affinity DataIC50:  730nM. Assay description: Inhibitory activity against human plasma renin.
In DepthDetails ArticlePubMed