BDBM50023805 4-Amino-2-benzyloxy-5-chloro-N-(2-diethylamino-ethyl)-benzamide::CHEMBL39623
SMILES CCN(CC)CCNC(=O)c1cc(Cl)c(N)cc1OCc1ccccc1
InChI Key InChIKey=RNDGARWUQSIOQW-UHFFFAOYSA-N
Data  1 IC50
  Tab Delimited (TSV)   2D SDfile   Computed 3D by Vconf -m prep SDfile
Find this compound or compounds like it in BindingDB:
Activity Spreadsheet -- Enzyme Inhibition Constant Data from BindingDB
Found 1 hit for monomerid = 50023805
TargetD(2) dopamine receptor(Rattus norvegicus (rat))
Bristol-Myers
Curated by ChEMBL
LigandPNGBDBM50023805(4-Amino-2-benzyloxy-5-chloro-N-(2-diethylamino-eth...)
Affinity DataIC50: >1.00E+3nM. Assay description: In vitro antagonistic activity against Dopamine receptor D2 was evaluated for the inhibition of [3H]spiperone binding
In DepthDetails ArticlePubMed