BDBM50023972 2-[(2,2-Dimethyl-cyclopropanecarbonyl)-amino]-8-mercapto-oct-2-enoic acid::CHEMBL273925
SMILES CC1(C)CC1C(=O)N\C(=C/CCCCCS)C(O)=O
InChI Key InChIKey=PFFBJOZGRHQIEO-XFFZJAGNSA-N
Data  1 KI
  Tab Delimited (TSV)   2D SDfile   Computed 3D by Vconf -m prep SDfile
Find this compound or compounds like it in BindingDB:
Activity Spreadsheet -- Enzyme Inhibition Constant Data from BindingDB
Found 1 hit for monomerid = 50023972
TargetDipeptidase 1(GUINEA PIG)
TBA
Curated by ChEMBL
LigandPNGBDBM50023972(2-[(2,2-Dimethyl-cyclopropanecarbonyl)-amino]-8-me...)
Affinity DataKi:  170nM. Assay description: Inhibitory activity against beta-lactamase renal dipeptidase
In DepthDetails ArticlePubMed