BDBM50023979 2-[(2,2-Dimethyl-cyclopropanecarbonyl)-amino]-7-(3-hydroxy-pyridin-2-ylsulfanyl)-hept-2-enoic acid::CHEMBL274188
SMILES CC1(C)CC1C(=O)N\C(=C/CCCCSc1ncccc1O)C(O)=O
InChI Key InChIKey=JHEDEOKFVYJLEE-QPEQYQDCSA-N
Data  1 KI
  Tab Delimited (TSV)   2D SDfile   Computed 3D by Vconf -m prep SDfile
Find this compound or compounds like it in BindingDB:
Activity Spreadsheet -- Enzyme Inhibition Constant Data from BindingDB
Found 1 hit for monomerid = 50023979
TargetDipeptidase 1(GUINEA PIG)
TBA
Curated by ChEMBL
LigandPNGBDBM50023979(2-[(2,2-Dimethyl-cyclopropanecarbonyl)-amino]-7-(3...)
Affinity DataKi:  20nM. Assay description: Inhibitory activity against beta-lactamase renal dipeptidase
In DepthDetails ArticlePubMed