BDBM50024024 2-[(2,2-Dibromo-cyclopropanecarbonyl)-amino]-but-2-enoic acid::CHEMBL268228
SMILES C\C=C(/NC(=O)C1CC1(Br)Br)C(O)=O
InChI Key InChIKey=DOOWJJQVHLMAGE-DJWKRKHSSA-N
Data  1 KI
  Tab Delimited (TSV)   2D SDfile   Computed 3D by Vconf -m prep SDfile
Find this compound or compounds like it in BindingDB:
Activity Spreadsheet -- Enzyme Inhibition Constant Data from BindingDB
Found 1 hit for monomerid = 50024024
TargetDipeptidase 1(GUINEA PIG)
TBA
Curated by ChEMBL
LigandPNGBDBM50024024(2-[(2,2-Dibromo-cyclopropanecarbonyl)-amino]-but-2...)
Affinity DataKi:  30nM. Assay description: Inhibitory activity against beta-lactamase renal dipeptidase
In DepthDetails ArticlePubMed