BDBM50024034 2-(Cycloheptanecarbonyl-amino)-but-2-enoic acid::CHEMBL274322
SMILES C\C=C(/NC(=O)C1CCCCCC1)C(O)=O
InChI Key InChIKey=HFNXJZJSMNTIME-SGAXSIHGSA-N
Data  1 KI
  Tab Delimited (TSV)   2D SDfile   Computed 3D by Vconf -m prep SDfile
Find this compound or compounds like it in BindingDB:
Activity Spreadsheet -- Enzyme Inhibition Constant Data from BindingDB
Found 1 hit for monomerid = 50024034
TargetDipeptidase 1(GUINEA PIG)
TBA
Curated by ChEMBL
LigandPNGBDBM50024034(2-(Cycloheptanecarbonyl-amino)-but-2-enoic acid | ...)
Affinity DataKi:  1.20E+4nM. Assay description: Inhibitory activity against beta-lactamase renal dipeptidase
In DepthDetails ArticlePubMed