BDBM50024045 2-[(2,2-Dimethyl-cyclopropanecarbonyl)-amino]-hex-2-enoic acid::CHEMBL273413
SMILES CCC\C=C(/NC(=O)C1CC1(C)C)C(O)=O
InChI Key InChIKey=FXENFQRQJUHCSD-TWGQIWQCSA-N
Data  1 KI
  Tab Delimited (TSV)   2D SDfile   Computed 3D by Vconf -m prep SDfile
Find this compound or compounds like it in BindingDB:
Activity Spreadsheet -- Enzyme Inhibition Constant Data from BindingDB
Found 1 hit for monomerid = 50024045
TargetDipeptidase 1(GUINEA PIG)
TBA
Curated by ChEMBL
LigandPNGBDBM50024045(2-[(2,2-Dimethyl-cyclopropanecarbonyl)-amino]-hex-...)
Affinity DataKi:  110nM. Assay description: Inhibitory activity against beta-lactamase renal dipeptidase
In DepthDetails ArticlePubMed